Target
5'-AMP-activated protein kinase catalytic subunit alpha-2
Ligand
BDBM327962
Substrate
Meas. Tech.
Enzyme-Linked Immunosorbent Assay
EC50
7500±n/a nM
Citation
 Irving, MShaw, S AMPK-activating heterocyclic compounds and methods for using the same US Patent  US9663496 Publication Date 5/30/2017 
Target
Name:
5'-AMP-activated protein kinase catalytic subunit alpha-2
Synonyms:
AAPK2_HUMAN AMP-activated protein kinase, alpha-2 subunit AMPK subunit alpha-2 AMPK2 Hydroxymethylglutaryl-CoA reductase kinase | PRKAA2
Type:
Enzyme
Mol. Mass.:
62331.02
Organism:
Homo sapiens (Human)
Description:
P54646
Residue:
552
  
Inhibitor
Name:
BDBM327962
Synonyms:
N-(4-(4-cyanobenzyl) cyclohexyl)-6-(4-(4- fluorobenzyl)piperazine- 1-carbonyl)picolinamide US9663496, Compound 99
Type:
Small organic molecule
Emp. Form.:
C32H34FN5O2
Mol. Mass.:
539.6431
SMILES:
Fc1ccc(CN2CCN(CC2)C(=O)c2cccc(n2)C(=O)NC2CCC(Cc3ccc(cc3)C#N)CC2)cc1
: