Target
5'-AMP-activated protein kinase catalytic subunit alpha-2
Ligand
BDBM327970
Substrate
Meas. Tech.
Enzyme-Linked Immunosorbent Assay
EC50
7500±n/a nM
Citation
 Irving, MShaw, S AMPK-activating heterocyclic compounds and methods for using the same US Patent  US9663496 Publication Date 5/30/2017 
Target
Name:
5'-AMP-activated protein kinase catalytic subunit alpha-2
Synonyms:
AAPK2_HUMAN AMP-activated protein kinase, alpha-2 subunit AMPK subunit alpha-2 AMPK2 Hydroxymethylglutaryl-CoA reductase kinase | PRKAA2
Type:
Enzyme
Mol. Mass.:
62331.02
Organism:
Homo sapiens (Human)
Description:
P54646
Residue:
552
  
Inhibitor
Name:
BDBM327970
Synonyms:
5-(4-(4- fluorobenzyl)piperazine- 1-carbonyl)-N- phenylpicolinamide US9663496, Compound 107
Type:
Small organic molecule
Emp. Form.:
C24H23FN4O2
Mol. Mass.:
418.4634
SMILES:
Fc1ccc(CN2CCN(CC2)C(=O)c2ccc(nc2)C(=O)Nc2ccccc2)cc1
: