Target
5'-AMP-activated protein kinase catalytic subunit alpha-2
Ligand
BDBM328057
Substrate
Meas. Tech.
Enzyme-Linked Immunosorbent Assay
EC50
<500±n/a nM
Citation
 Irving, MShaw, S AMPK-activating heterocyclic compounds and methods for using the same US Patent  US9663496 Publication Date 5/30/2017 
Target
Name:
5'-AMP-activated protein kinase catalytic subunit alpha-2
Synonyms:
AAPK2_HUMAN AMP-activated protein kinase, alpha-2 subunit AMPK subunit alpha-2 AMPK2 Hydroxymethylglutaryl-CoA reductase kinase | PRKAA2
Type:
Enzyme
Mol. Mass.:
62331.02
Organism:
Homo sapiens (Human)
Description:
P54646
Residue:
552
  
Inhibitor
Name:
BDBM328057
Synonyms:
5-(4-(4- methoxyphenoxy) piperidine-1-carbonyl)- N-(1-(4-(pyrrolidin-1- yl)benzyl)piperidin-4- yl)picolinamide US9663496, Compound 195
Type:
Small organic molecule
Emp. Form.:
C35H43N5O4
Mol. Mass.:
597.747
SMILES:
COc1ccc(OC2CCN(CC2)C(=O)c2ccc(nc2)C(=O)NC2CCN(Cc3ccc(cc3)N3CCCC3)CC2)cc1
: