Target
5'-AMP-activated protein kinase catalytic subunit alpha-2
Ligand
BDBM328273
Substrate
Meas. Tech.
Enzyme-Linked Immunosorbent Assay
EC50
3000±n/a nM
Citation
 Irving, MShaw, S AMPK-activating heterocyclic compounds and methods for using the same US Patent  US9663496 Publication Date 5/30/2017 
Target
Name:
5'-AMP-activated protein kinase catalytic subunit alpha-2
Synonyms:
AAPK2_HUMAN AMP-activated protein kinase, alpha-2 subunit AMPK subunit alpha-2 AMPK2 Hydroxymethylglutaryl-CoA reductase kinase | PRKAA2
Type:
Enzyme
Mol. Mass.:
62331.02
Organism:
Homo sapiens (Human)
Description:
P54646
Residue:
552
  
Inhibitor
Name:
BDBM328273
Synonyms:
6-(4-(3- acetamidophenoxy) piperidine-1-carbonyl)- N-(1-(4- cyanobenzyl)piperidin-4- yl)nicotinamide US9663496, Compound 411
Type:
Small organic molecule
Emp. Form.:
C33H36N6O4
Mol. Mass.:
580.6767
SMILES:
CC(=O)Nc1cccc(OC2CCN(CC2)C(=O)c2ccc(cn2)C(=O)NC2CCN(Cc3ccc(cc3)C#N)CC2)c1
: