Target
5'-AMP-activated protein kinase catalytic subunit alpha-2
Ligand
BDBM328278
Substrate
Meas. Tech.
Enzyme-Linked Immunosorbent Assay
EC50
3000±n/a nM
Citation
 Irving, MShaw, S AMPK-activating heterocyclic compounds and methods for using the same US Patent  US9663496 Publication Date 5/30/2017 
Target
Name:
5'-AMP-activated protein kinase catalytic subunit alpha-2
Synonyms:
AAPK2_HUMAN AMP-activated protein kinase, alpha-2 subunit AMPK subunit alpha-2 AMPK2 Hydroxymethylglutaryl-CoA reductase kinase | PRKAA2
Type:
Enzyme
Mol. Mass.:
62331.02
Organism:
Homo sapiens (Human)
Description:
P54646
Residue:
552
  
Inhibitor
Name:
BDBM328278
Synonyms:
US10377742, Compound 416 tert-butyl 3-(5-(1-(4- cyanobenzyl)piperidin-4- ylcarbamoyl)-2-(4-(4- methoxybenzoyl) piperidine-1- carbonyl)pyridin-3- yl)propylcarbamate
Type:
Small organic molecule
Emp. Form.:
C41H50N6O6
Mol. Mass.:
722.8723
SMILES:
COc1ccc(cc1)C(=O)C1CCN(CC1)C(=O)c1ncc(cc1CCCNC(=O)OC(C)(C)C)C(=O)NC1CCN(Cc2ccc(cc2)C#N)CC1
: