Target
Nuclear receptor ROR-gamma
Ligand
BDBM328626
Substrate
Meas. Tech.
Biochemical TR-FRET assay
IC50
3.67±n/a nM
Citation
 Aicher, TDVanHuis, CAMacLean, JAndresen, BMBarr, KJBienstock, CAnthony, NJDaniels, MLiu, YWhite, CLapointe, BTSciammetta, NSimov, VTrotter, WBLiu, K 2-Acylamidomethyl and sulfonylamidomethyl benzoxazine carbamates for inhibition of RORgamma activity and the treatment of disease US Patent  US9663502 Publication Date 5/30/2017 
Target
Name:
Nuclear receptor ROR-gamma
Synonyms:
NR1F3 Nuclear receptor ROR-gamma (RORC) RAR-related orphan receptor C (RORc) RORG RZRG Retinoid-related orphan receptor-gamma (RORc)
Type:
Enzyme Catalytic Domain
Mol. Mass.:
58218.40
Organism:
Homo sapiens (Human)
Description:
P51449
Residue:
518
  
Inhibitor
Name:
BDBM328626
Synonyms:
2-(trifluoromethyl)cyclohexyl ((S)- 2-(acetamidomethyl)-4-((4- fluorophenyl)sulfonyl)-3,4- dihydro-2H-benzo[b][1,4]oxazin- 6-yl)carbamate | US9663502, 27E
Type:
Small organic molecule
Emp. Form.:
C25H27F4N3O6S
Mol. Mass.:
573.557
SMILES:
CC(=O)NC[C@H]1CN(c2cc(NC(=O)OC3CCCCC3C(F)(F)F)ccc2O1)S(=O)(=O)c1ccc(F)cc1
: