Target
Nuclear receptor ROR-gamma
Ligand
BDBM328838
Substrate
Meas. Tech.
Biochemical TR-FRET assay
IC50
2.68±n/a nM
Citation
 Aicher, TDVanHuis, CAMacLean, JAndresen, BMBarr, KJBienstock, CAnthony, NJDaniels, MLiu, YWhite, CLapointe, BTSciammetta, NSimov, VTrotter, WBLiu, K 2-Acylamidomethyl and sulfonylamidomethyl benzoxazine carbamates for inhibition of RORgamma activity and the treatment of disease US Patent  US9663502 Publication Date 5/30/2017 
Target
Name:
Nuclear receptor ROR-gamma
Synonyms:
NR1F3 Nuclear receptor ROR-gamma (RORC) RAR-related orphan receptor C (RORc) RORG RZRG Retinoid-related orphan receptor-gamma (RORc)
Type:
Enzyme Catalytic Domain
Mol. Mass.:
58218.40
Organism:
Homo sapiens (Human)
Description:
P51449
Residue:
518
  
Inhibitor
Name:
BDBM328838
Synonyms:
(S)-tert-butyl (4-((3-chloro-4- fluorophenyl)sulfonyl)-2- (methylsulfonamidomethyl)-3,4- dihydro-2H-benzo[b][1,4]oxazin-6- yl)carbamate | US9663502, 37H
Type:
Small organic molecule
Emp. Form.:
C21H25ClFN3O7S2
Mol. Mass.:
550.021
SMILES:
CC(C)(C)OC(=O)Nc1ccc2O[C@@H](CNS(C)(=O)=O)CN(c2c1)S(=O)(=O)c1ccc(F)c(Cl)c1
: