Target
Serine/threonine-protein kinase Chk1
Ligand
BDBM328997
Substrate
Meas. Tech.
Caliper Assay
IC50
2.00±n/a nM
Citation
 Collins, IMatthews, TPMchardy, TFOsborne, JLainchbury, MWalton, MIGarrett, MD 5-[[4-[[morpholin-2-yl]methylamino]-5-(trifluoromethyl)-2-pyridyl]amino]pyrazine-2-carbonitrile and therapeutic uses thereof US Patent  US9663503 Publication Date 5/30/2017 
Target
Name:
Serine/threonine-protein kinase Chk1
Synonyms:
CHEK1 CHK1 checkpoint homolog Checkpoint kinase-1 (CHK1)
Type:
Enzyme Catalytic Domain
Mol. Mass.:
54443.02
Organism:
Homo sapiens (Human)
Description:
gi_166295192
Residue:
476
  
Inhibitor
Name:
BDBM328997
Synonyms:
1137478-45-5 US9663503, Compound Y-152
Type:
Small organic molecule
Emp. Form.:
C19H21N9O
Mol. Mass.:
391.4297
SMILES:
Cn1cc(cn1)-c1cnc(Nc2cnc(cn2)C#N)cc1NC[C@@H]1CNCCO1
: