Target
Metabotropic glutamate receptor 2
Ligand
BDBM212892
Substrate
Meas. Tech.
Biological Assay
IC50
8.00±n/a nM
Citation
 Bungard, CJConverso, ADe Leon, PHanney, BHartingh, TJManikowski, JJManley, PJMeissner, RMeng, ZPerkins, JJRudd, MTShu, Y Quinoline carboxamide and quinoline carbonitrile derivatives as mGluR2-negative allosteric modulators, compositions, and their use US Patent  US9663506 Publication Date 5/30/2017 
Target
Name:
Metabotropic glutamate receptor 2
Synonyms:
GPRC1B GRM2_HUMAN Metabotropic glutamate receptor mGlu2 | metabotropic glutamate 2
Type:
Enzyme
Mol. Mass.:
95584.88
Organism:
Homo sapiens (Human)
Description:
Q14416
Residue:
872
  
Inhibitor
Name:
BDBM212892
Synonyms:
US9278960, 2-39 | US9663506, Example 2-39
Type:
Small organic molecule
Emp. Form.:
C22H18FN3O4
Mol. Mass.:
407.3944
SMILES:
COc1ccc(c(F)c1)-c1cc(nc2cc(CN3C(=O)CCC3=O)ccc12)C(N)=O
: