Target
Metabotropic glutamate receptor 2
Ligand
BDBM213088
Substrate
Meas. Tech.
Biological Assay
IC50
15.0±n/a nM
Citation
 Bungard, CJConverso, ADe Leon, PHanney, BHartingh, TJManikowski, JJManley, PJMeissner, RMeng, ZPerkins, JJRudd, MTShu, Y Quinoline carboxamide and quinoline carbonitrile derivatives as mGluR2-negative allosteric modulators, compositions, and their use US Patent  US9663506 Publication Date 5/30/2017 
Target
Name:
Metabotropic glutamate receptor 2
Synonyms:
GPRC1B GRM2_HUMAN Metabotropic glutamate receptor mGlu2 | metabotropic glutamate 2
Type:
Enzyme
Mol. Mass.:
95584.88
Organism:
Homo sapiens (Human)
Description:
Q14416
Residue:
872
  
Inhibitor
Name:
BDBM213088
Synonyms:
US9278960, 7-26 | US9636337, 7-26
Type:
Small organic molecule
Emp. Form.:
C23H17F2N3O2
Mol. Mass.:
405.3968
SMILES:
NC(=O)c1cc(-c2ccc(F)cc2)c2ccc(Cc3ccc(CO)nc3)c(F)c2n1
: