Target
Metabotropic glutamate receptor 2
Ligand
BDBM213109
Substrate
Meas. Tech.
Biological Assay
IC50
10.00±n/a nM
Citation
 Bungard, CJConverso, ADe Leon, PHanney, BHartingh, TJManikowski, JJManley, PJMeissner, RMeng, ZPerkins, JJRudd, MTShu, Y Quinoline carboxamide and quinoline carbonitrile derivatives as mGluR2-negative allosteric modulators, compositions, and their use US Patent  US9663506 Publication Date 5/30/2017 
Target
Name:
Metabotropic glutamate receptor 2
Synonyms:
GPRC1B GRM2_HUMAN Metabotropic glutamate receptor mGlu2 | metabotropic glutamate 2
Type:
Enzyme
Mol. Mass.:
95584.88
Organism:
Homo sapiens (Human)
Description:
Q14416
Residue:
872
  
Inhibitor
Name:
BDBM213109
Synonyms:
US9278960, 8-16 | US9636337, 8-16
Type:
Small organic molecule
Emp. Form.:
C23H18FN3O
Mol. Mass.:
371.4069
SMILES:
NC(=O)c1cc(-c2ccc(F)cc2)c2ccc(CCc3cccnc3)cc2n1
: