Target
Sodium channel protein type 9 subunit alpha
Ligand
BDBM329040
Substrate
Meas. Tech.
Nav 1.7 In Vitro Patch Express (PX) Assay
IC50
38.6±n/a nM
Citation
 Bregman, HChakka, NDimauro, EFGao, HGunaydin, HHuang, HOlivieri, PRSchenkel, LWeiss, M Biaryl acyl-sulfonamide compounds as sodium channel inhibitors US Patent  US9663508 Publication Date 5/30/2017 
Target
Name:
Sodium channel protein type 9 subunit alpha
Synonyms:
NENA Peripheral sodium channel 1 SCN9A_HUMAN Voltage-gated sodium channel subunit Nav1.7 hNE-Na
Type:
Protein
Mol. Mass.:
226375.97
Organism:
Homo sapiens (Human)
Description:
Q15858
Residue:
1988
  
Inhibitor
Name:
BDBM329040
Synonyms:
4-(5-chloro-6-(2-chloro-5- methylphenoxy)-3-pyridinyl)- N-(methylsulfonyl)-3-(3- oxetanyloxy)benzamide US9663508, Example 423
Type:
Small organic molecule
Emp. Form.:
C23H20Cl2N2O6S
Mol. Mass.:
523.386
SMILES:
Cc1ccc(Cl)c(Oc2ncc(cc2Cl)-c2ccc(cc2OC2COC2)C(=O)NS(C)(=O)=O)c1
: