Target
Sodium channel protein type 9 subunit alpha
Ligand
BDBM329074
Substrate
Meas. Tech.
Nav 1.7 In Vitro Patch Express (PX) Assay
IC50
42.4±n/a nM
Citation
 Bregman, HChakka, NDimauro, EFGao, HGunaydin, HHuang, HOlivieri, PRSchenkel, LWeiss, M Biaryl acyl-sulfonamide compounds as sodium channel inhibitors US Patent  US9663508 Publication Date 5/30/2017 
Target
Name:
Sodium channel protein type 9 subunit alpha
Synonyms:
NENA Peripheral sodium channel 1 SCN9A_HUMAN Voltage-gated sodium channel subunit Nav1.7 hNE-Na
Type:
Protein
Mol. Mass.:
226375.97
Organism:
Homo sapiens (Human)
Description:
Q15858
Residue:
1988
  
Inhibitor
Name:
BDBM329074
Synonyms:
4-(5-bromo-6-(2,4-dichloro-6- methylphenoxy)-3-pyridinyl)- 2,5-difluoro-N- (methylsulfonyl)benzamide US9663508, Example 575
Type:
Small organic molecule
Emp. Form.:
C20H13BrCl2F2N2O4S
Mol. Mass.:
566.2
SMILES:
Cc1cc(Cl)cc(Cl)c1Oc1ncc(cc1Br)-c1cc(F)c(cc1F)C(=O)NS(C)(=O)=O
: