Target
Sodium channel protein type 9 subunit alpha
Ligand
BDBM329084
Substrate
Meas. Tech.
Nav 1.7 In Vitro Patch Express (PX) Assay
IC50
47.2±n/a nM
Citation
 Bregman, HChakka, NDimauro, EFGao, HGunaydin, HHuang, HOlivieri, PRSchenkel, LWeiss, M Biaryl acyl-sulfonamide compounds as sodium channel inhibitors US Patent  US9663508 Publication Date 5/30/2017 
Target
Name:
Sodium channel protein type 9 subunit alpha
Synonyms:
NENA Peripheral sodium channel 1 SCN9A_HUMAN Voltage-gated sodium channel subunit Nav1.7 hNE-Na
Type:
Protein
Mol. Mass.:
226375.97
Organism:
Homo sapiens (Human)
Description:
Q15858
Residue:
1988
  
Inhibitor
Name:
BDBM329084
Synonyms:
4-(5-chloro-6-(2,4-dichloro-6- methylphenoxy)-3-pyridinyl)-3- (difluoromethoxy)-N- (methylsulfonyl)benzamide US9663508, Example 585
Type:
Small organic molecule
Emp. Form.:
C21H15Cl3F2N2O5S
Mol. Mass.:
551.775
SMILES:
Cc1cc(Cl)cc(Cl)c1Oc1ncc(cc1Cl)-c1ccc(cc1OC(F)F)C(=O)NS(C)(=O)=O
: