Target
Sodium channel protein type 9 subunit alpha
Ligand
BDBM329107
Substrate
Meas. Tech.
Nav 1.7 In Vitro Patch Express (PX) Assay
IC50
48.1±n/a nM
Citation
 Bregman, HChakka, NDimauro, EFGao, HGunaydin, HHuang, HOlivieri, PRSchenkel, LWeiss, M Biaryl acyl-sulfonamide compounds as sodium channel inhibitors US Patent  US9663508 Publication Date 5/30/2017 
Target
Name:
Sodium channel protein type 9 subunit alpha
Synonyms:
NENA Peripheral sodium channel 1 SCN9A_HUMAN Voltage-gated sodium channel subunit Nav1.7 hNE-Na
Type:
Protein
Mol. Mass.:
226375.97
Organism:
Homo sapiens (Human)
Description:
Q15858
Residue:
1988
  
Inhibitor
Name:
BDBM329107
Synonyms:
4-(5-chloro-6-((2-methyl-1- naphthalenyl)oxy)-3-pyridinyl)- 2-fluoro-5-methyl-N- (methylsulfonyl)benzamide US9663508, Example 608
Type:
Small organic molecule
Emp. Form.:
C25H20ClFN2O4S
Mol. Mass.:
498.954
SMILES:
Cc1ccc2ccccc2c1Oc1ncc(cc1Cl)-c1cc(F)c(cc1C)C(=O)NS(C)(=O)=O
: