Target
Sodium channel protein type 5 subunit alpha
Ligand
BDBM329162
Substrate
Meas. Tech.
Nav 1.5 In Vitro PX Assay
IC50
>10000±n/a nM
Citation
 Bregman, HChakka, NDimauro, EFGao, HGunaydin, HHuang, HOlivieri, PRSchenkel, LWeiss, M Biaryl acyl-sulfonamide compounds as sodium channel inhibitors US Patent  US9663508 Publication Date 5/30/2017 
Target
Name:
Sodium channel protein type 5 subunit alpha
Synonyms:
HH1 SCN5A_HUMAN Sodium channel protein type 5 subunit alpha/beta-1/beta-2 Voltage-gated sodium channel subunit alpha Nav1.5
Type:
Enzyme
Mol. Mass.:
226908.60
Organism:
Homo sapiens (Human)
Description:
Q14524
Residue:
2016
  
Inhibitor
Name:
BDBM329162
Synonyms:
4-(5-chloro-6-(3,4- dichlorophenoxy)-3-pyridinyl)- 2-fluoro-5-methyl-N- (methylsulfonyl)benzamide US9663508, Example 664
Type:
Small organic molecule
Emp. Form.:
C20H14Cl3FN2O4S
Mol. Mass.:
503.759
SMILES:
Cc1cc(C(=O)NS(C)(=O)=O)c(F)cc1-c1cnc(Oc2ccc(Cl)c(Cl)c2)c(Cl)c1
: