Target
Sodium channel protein type 9 subunit alpha
Ligand
BDBM329261
Substrate
Meas. Tech.
Nav 1.7 In Vitro Patch Express (PX) Assay
IC50
36.7±n/a nM
Citation
 Bregman, HChakka, NDimauro, EFGao, HGunaydin, HHuang, HOlivieri, PRSchenkel, LWeiss, M Biaryl acyl-sulfonamide compounds as sodium channel inhibitors US Patent  US9663508 Publication Date 5/30/2017 
Target
Name:
Sodium channel protein type 9 subunit alpha
Synonyms:
NENA Peripheral sodium channel 1 SCN9A_HUMAN Voltage-gated sodium channel subunit Nav1.7 hNE-Na
Type:
Protein
Mol. Mass.:
226375.97
Organism:
Homo sapiens (Human)
Description:
Q15858
Residue:
1988
  
Inhibitor
Name:
BDBM329261
Synonyms:
4-(5-chloro-6-(2,6- dichlorophenoxy)-3-pyridinyl)- 2-fluoro-5-methoxy-N- (methylsulfonyl)benzamide US9663508, Example 764
Type:
Small organic molecule
Emp. Form.:
C20H14Cl3FN2O5S
Mol. Mass.:
519.758
SMILES:
COc1cc(C(=O)NS(C)(=O)=O)c(F)cc1-c1cnc(Oc2c(Cl)cccc2Cl)c(Cl)c1
: