Target
Neutrophil collagenase
Ligand
BDBM11865
Substrate
MMP Fluorogenic Peptide Substrate
Meas. Tech.
Enzyme Inhibition Assay
Ki
2.4±n/a nM
Citation
 Becker, DPVillamil, CIBarta, TEBedell, LJBoehm, TLDecrescenzo, GAFreskos, JNGetman, DPHockerman, SHeintz, RHoward, SCLi, MHMcDonald, JJCarron, CPFunckes-Shippy, CLMehta, PPMunie, GESwearingen, CA Synthesis and structure-activity relationships of beta- and alpha-piperidine sulfone hydroxamic acid matrix metalloproteinase inhibitors with oral antitumor efficacy. J Med Chem 48:6713-30 (2005)  
Target
Name:
Neutrophil collagenase
Synonyms:
CLG1 MMP8 Matrix metalloproteinase-8 PMNL collagenase | PMNL-CL
Type:
Enzyme
Mol. Mass.:
53413.48
Organism:
Homo sapiens (Human)
Description:
P22894
Residue:
467
  
Inhibitor
Name:
BDBM11865
Synonyms:
N-Hydroxy-4-{[(4-phenoxyphenyl)sulfonyl]methyl}-piperidine-4-carboxamide Hydrochloride beta-sulfone 7b
Type:
Small organic molecule
Emp. Form.:
C19H22N2O5S
Mol. Mass.:
390.453
SMILES:
ONC(=O)C1(CS(=O)(=O)c2ccc(Oc3ccccc3)cc2)CCNCC1
:
Substrate
Name:
MMP Fluorogenic Peptide Substrate
Synonyms:
Type:
Peptide
Mol. Mass.:
2468.31
Organism:
Description:
Residue:
23