Target
Collagenase 3
Ligand
BDBM11866
Substrate
MMP Fluorogenic Peptide Substrate
Meas. Tech.
Enzyme Inhibition Assay
Ki
0.4±n/a nM
Citation
 Becker, DPVillamil, CIBarta, TEBedell, LJBoehm, TLDecrescenzo, GAFreskos, JNGetman, DPHockerman, SHeintz, RHoward, SCLi, MHMcDonald, JJCarron, CPFunckes-Shippy, CLMehta, PPMunie, GESwearingen, CA Synthesis and structure-activity relationships of beta- and alpha-piperidine sulfone hydroxamic acid matrix metalloproteinase inhibitors with oral antitumor efficacy. J Med Chem 48:6713-30 (2005)  
Target
Name:
Collagenase 3
Synonyms:
MMP-13 MMP13_HUMAN Matrix metalloproteinase-13 (MMP-13) | Matrix metalloproteinase-13 (MMP13)
Type:
Enzyme
Mol. Mass.:
53808.06
Organism:
Homo sapiens (Human)
Description:
P45452
Residue:
471
  
Inhibitor
Name:
BDBM11866
Synonyms:
N-Hydroxy-1-(3-methoxybenzyl)-4-{[(4-phenoxyphenyl)-sulfonyl]methyl}piperidine-4-carboxamide Hydrochloride beta-sulfone 7c
Type:
Small organic molecule
Emp. Form.:
C27H30N2O6S
Mol. Mass.:
510.602
SMILES:
COc1cccc(CN2CCC(CS(=O)(=O)c3ccc(Oc4ccccc4)cc3)(CC2)C(=O)NO)c1
:
Substrate
Name:
MMP Fluorogenic Peptide Substrate
Synonyms:
Type:
Peptide
Mol. Mass.:
2468.31
Organism:
Description:
Residue:
23