Target
Dual specificity protein kinase TTK
Ligand
BDBM329336
Substrate
Meas. Tech.
Mps-1 Kinase Assay
IC50
<1.000±n/a nM
Citation
 Schulze, VKosemund, DWengner, AMSiemeister, GStöckigt, DBrüning, M Substituted triazolopyridines and their use as TTK inhibitors US Patent  US9663510 Publication Date 5/30/2017 
Target
Name:
Dual specificity protein kinase TTK
Synonyms:
Dual specificity protein kinase (TTK) MPS1 Monopolar Spindle 1 (MPS1) Monopolar Spindle 1 Kinase (MPS1) TTK | TTK_HUMAN
Type:
Protein
Mol. Mass.:
97086.79
Organism:
Homo sapiens (Human)
Description:
P33981
Residue:
857
  
Inhibitor
Name:
BDBM329336
Synonyms:
(2R)-2-(4-fluorophenyl)-N-[4-(2-{[4-(methylsulfonyl)-2-(2,2,2-trifluoro-ethoxy)phenyl]amino}[1,2,4]triazolo[1,5-a]pyridin-6-yl)phenyl]-propanamide | US9663510, Example 01.03
Type:
Small organic molecule
Emp. Form.:
C30H25F4N5O4S
Mol. Mass.:
627.609
SMILES:
C[C@@H](C(=O)Nc1ccc(cc1)-c1ccc2nc(Nc3ccc(cc3OCC(F)(F)F)S(C)(=O)=O)nn2c1)c1ccc(F)cc1
: