Target
Dual specificity protein kinase TTK
Ligand
BDBM329360
Substrate
Meas. Tech.
Mps-1 Kinase Assay
IC50
13.0±n/a nM
Citation
 Schulze, VKosemund, DWengner, AMSiemeister, GStöckigt, DBrüning, M Substituted triazolopyridines and their use as TTK inhibitors US Patent  US9663510 Publication Date 5/30/2017 
Target
Name:
Dual specificity protein kinase TTK
Synonyms:
Dual specificity protein kinase (TTK) MPS1 Monopolar Spindle 1 (MPS1) Monopolar Spindle 1 Kinase (MPS1) TTK | TTK_HUMAN
Type:
Protein
Mol. Mass.:
97086.79
Organism:
Homo sapiens (Human)
Description:
P33981
Residue:
857
  
Inhibitor
Name:
BDBM329360
Synonyms:
US9663510, Example comparitive example disclosed in WO 2011/063908 A1
Type:
Small organic molecule
Emp. Form.:
C27H21F3N6O
Mol. Mass.:
502.4904
SMILES:
NC(C(=O)Nc1ccc(cc1)-c1ccc2nc(Nc3ccccc3C(F)(F)F)nn2c1)c1ccccc1
: