Target
Sphingosine 1-phosphate receptor 2
Ligand
BDBM329370
Substrate
Meas. Tech.
In Vitro Binding Assay
IC50
3000±n/a nM
Citation
 Swenson, RE Sphingosine 1-phosphate receptor antagonists US Patent  US9663511 Publication Date 5/30/2017 
Target
Name:
Sphingosine 1-phosphate receptor 2
Synonyms:
EDG5 S1PR2 Sphingosine 1-phosphate receptor Sphingosine-1-phosphate receptor 2 | ndothelial differentiation G-protein coupled receptor 5
Type:
G Protein-Coupled Receptor (GPCR)
Mol. Mass.:
38883.16
Organism:
Homo sapiens (Human)
Description:
Membranes isolated from S1P2-transfected CHO cells were used in ligand binding assay.
Residue:
353
  
Inhibitor
Name:
BDBM329370
Synonyms:
US9663511, Compound 3.
Type:
Small organic molecule
Emp. Form.:
C21H23Cl2N7O3
Mol. Mass.:
492.358
SMILES:
CC(C)c1cc(nc2n(CC=C)nc(C)c12)N(CC(O)=O)NC(=O)Nc1cc(Cl)nc(Cl)c1
: