Target
Sphingosine 1-phosphate receptor 5
Ligand
BDBM329377
Substrate
Meas. Tech.
In Vitro Binding Assay
IC50
12.0±n/a nM
Citation
 Swenson, RE Sphingosine 1-phosphate receptor antagonists US Patent  US9663511 Publication Date 5/30/2017 
Target
Name:
Sphingosine 1-phosphate receptor 5
Synonyms:
EDG8 S1P5 S1PR5_HUMAN Sphingosine 1-phosphate receptor Edg-8
Type:
G Protein-Coupled Receptor (GPCR)
Mol. Mass.:
41796.42
Organism:
Homo sapiens (Human)
Description:
Residue:
398
  
Inhibitor
Name:
BDBM329377
Synonyms:
US9663511, Compound 34.
Type:
Small organic molecule
Emp. Form.:
C20H25Cl2N7O2
Mol. Mass.:
466.364
SMILES:
CC(C)c1cc(nc2n(C)nc(C)c12)N(CCCO)NC(=O)Nc1cc(Cl)nc(Cl)c1
: