Target
Sphingosine 1-phosphate receptor 5
Ligand
BDBM329379
Substrate
Meas. Tech.
In Vitro Binding Assay
IC50
33.0±n/a nM
Citation
 Swenson, RE Sphingosine 1-phosphate receptor antagonists US Patent  US9663511 Publication Date 5/30/2017 
Target
Name:
Sphingosine 1-phosphate receptor 5
Synonyms:
EDG8 S1P5 S1PR5_HUMAN Sphingosine 1-phosphate receptor Edg-8
Type:
G Protein-Coupled Receptor (GPCR)
Mol. Mass.:
41796.42
Organism:
Homo sapiens (Human)
Description:
Residue:
398
  
Inhibitor
Name:
BDBM329379
Synonyms:
US9663511, Compound 36.
Type:
Small organic molecule
Emp. Form.:
C22H30ClN7O3
Mol. Mass.:
475.972
SMILES:
CCCOc1cc(NC(=O)NN(CCO)c2cc(C(C)C)c3c(C)nn(C)c3n2)cc(Cl)n1
: