Target
Phosphatidylinositol 4,5-bisphosphate 3-kinase catalytic subunit delta isoform
Ligand
BDBM195333
Substrate
Meas. Tech.
Luciferase-Coupled Chemiluminescence Assay
IC50
<50±n/a nM
Citation
 Leahy, JW Inhibitors of PI3K-delta and methods of their use and manufacture US Patent  US9670212 Publication Date 6/6/2017 
Target
Name:
Phosphatidylinositol 4,5-bisphosphate 3-kinase catalytic subunit delta isoform
Synonyms:
PI3-kinase p110 subunit delta PI3-kinase subunit p110-delta PIK3CD Phosphatidylinositol 4,5-biphosphate 3-kinase catalytic subunit delta (PIK3CD) Phosphatidylinositol 4,5-bisphosphate 3-kinase 110 kDa catalytic subunit delta (PI3K delta) Phosphatidylinositol 4,5-bisphosphate 3-kinase catalytic subunit delta (PI3Kdelta) Phosphatidylinositol 4,5-bisphosphate 3-kinase catalytic subunit delta isoform (PI3K delta) Phosphatidylinositol 4,5-bisphosphate 3-kinase catalytic subunit delta isoform (PI3K-delta) Phosphatidylinositol 4,5-bisphosphate 3-kinase catalytic subunit delta isoform (PI3Kdelta)
Type:
Enzyme Subunit
Mol. Mass.:
119489.41
Organism:
Homo sapiens (Human)
Description:
O00329
Residue:
1044
  
Inhibitor
Name:
BDBM195333
Synonyms:
US9670212, 42 3-amino-N-{[8-methyl-2-(methyl{2-[methyl(1H-tetrazol-1-ylacetyl)amino]ethyl}amino)quinolin-3-yl]methyl}pyrazine-2-carboxamide
Type:
Small organic molecule
Emp. Form.:
C23H27N11O2
Mol. Mass.:
489.533
SMILES:
CN(CCN(C)c1nc2c(C)cccc2cc1CNC(=O)c1nccnc1N)C(=O)Cn1cnnn1
: