Target
Phosphatidylinositol 4,5-bisphosphate 3-kinase catalytic subunit delta isoform
Ligand
BDBM195812
Substrate
Meas. Tech.
Luciferase-Coupled Chemiluminescence Assay
IC50
1000±n/a nM
Citation
 Leahy, JW Inhibitors of PI3K-delta and methods of their use and manufacture US Patent  US9670212 Publication Date 6/6/2017 
Target
Name:
Phosphatidylinositol 4,5-bisphosphate 3-kinase catalytic subunit delta isoform
Synonyms:
PI3-kinase p110 subunit delta PI3-kinase subunit p110-delta PIK3CD Phosphatidylinositol 4,5-biphosphate 3-kinase catalytic subunit delta (PIK3CD) Phosphatidylinositol 4,5-bisphosphate 3-kinase 110 kDa catalytic subunit delta (PI3K delta) Phosphatidylinositol 4,5-bisphosphate 3-kinase catalytic subunit delta (PI3Kdelta) Phosphatidylinositol 4,5-bisphosphate 3-kinase catalytic subunit delta isoform (PI3K delta) Phosphatidylinositol 4,5-bisphosphate 3-kinase catalytic subunit delta isoform (PI3K-delta) Phosphatidylinositol 4,5-bisphosphate 3-kinase catalytic subunit delta isoform (PI3Kdelta)
Type:
Enzyme Subunit
Mol. Mass.:
119489.41
Organism:
Homo sapiens (Human)
Description:
O00329
Residue:
1044
  
Inhibitor
Name:
BDBM195812
Synonyms:
US9670212, 165 3-[(6-amino-9H-purin-9-yl)methyl]-8-methyl-N-(tetrahydro-2H-pyran-4-yl)quinolin-2-amine
Type:
Small organic molecule
Emp. Form.:
C21H23N7O
Mol. Mass.:
389.4536
SMILES:
Cc1cccc2cc(Cn3cnc4c(N)ncnc34)c(NC3CCOCC3)nc12
: