Target
Phosphatidylinositol 4,5-bisphosphate 3-kinase catalytic subunit delta isoform
Ligand
BDBM195814
Substrate
Meas. Tech.
Luciferase-Coupled Chemiluminescence Assay
IC50
1000±n/a nM
Citation
 Leahy, JW Inhibitors of PI3K-delta and methods of their use and manufacture US Patent  US9670212 Publication Date 6/6/2017 
Target
Name:
Phosphatidylinositol 4,5-bisphosphate 3-kinase catalytic subunit delta isoform
Synonyms:
PI3-kinase p110 subunit delta PI3-kinase subunit p110-delta PIK3CD Phosphatidylinositol 4,5-biphosphate 3-kinase catalytic subunit delta (PIK3CD) Phosphatidylinositol 4,5-bisphosphate 3-kinase 110 kDa catalytic subunit delta (PI3K delta) Phosphatidylinositol 4,5-bisphosphate 3-kinase catalytic subunit delta (PI3Kdelta) Phosphatidylinositol 4,5-bisphosphate 3-kinase catalytic subunit delta isoform (PI3K delta) Phosphatidylinositol 4,5-bisphosphate 3-kinase catalytic subunit delta isoform (PI3K-delta) Phosphatidylinositol 4,5-bisphosphate 3-kinase catalytic subunit delta isoform (PI3Kdelta)
Type:
Enzyme Subunit
Mol. Mass.:
119489.41
Organism:
Homo sapiens (Human)
Description:
O00329
Residue:
1044
  
Inhibitor
Name:
BDBM195814
Synonyms:
US9670212, 167 3-[(6-amino-9H-purin-9-yl)methyl]-8-methyl-N-[2-(methyloyx)ethyl]quinolin-2-amine
Type:
Small organic molecule
Emp. Form.:
C19H21N7O
Mol. Mass.:
363.4163
SMILES:
COCCNc1nc2c(C)cccc2cc1Cn1cnc2c(N)ncnc12
: