Target
cAMP and cAMP-inhibited cGMP 3',5'-cyclic phosphodiesterase 10A
Ligand
BDBM329427
Substrate
Meas. Tech.
Fluorescence Polarization Assay
Ki
5.08±n/a nM
Citation
 Kuduk, SDMcComas, CCReger, TS Pyrimidine PDE10 inhibitors US Patent  US9663513 Publication Date 5/30/2017 
Target
Name:
cAMP and cAMP-inhibited cGMP 3',5'-cyclic phosphodiesterase 10A
Synonyms:
3',5'-cyclic phosphodiesterase PDE10_HUMAN Phosphodiesterase 10A
Type:
Protein
Mol. Mass.:
88412.52
Organism:
Homo sapiens (Human)
Description:
Q9Y233
Residue:
779
  
Inhibitor
Name:
BDBM329427
Synonyms:
5-(3-ethoxyphenyl)-2- methyl-6-(((1S,2S)-2- (quinolin-2- yl)cyclopropyl)methoxy) pyrimidin-1-ium 2,2,2- trifluoroacetate (enantiomer A) US9663513, 41
Type:
Small organic molecule
Emp. Form.:
C26H26N3O2
Mol. Mass.:
412.503
SMILES:
CCOc1cccc(c1)-c1cnc(C)[nH+]c1OC[C@H]1C[C@@H]1c1ccc2ccccc2n1
: