Target
cAMP and cAMP-inhibited cGMP 3',5'-cyclic phosphodiesterase 10A
Ligand
BDBM329474
Substrate
Meas. Tech.
Fluorescence Polarization Assay
Ki
0.440±n/a nM
Citation
 Kuduk, SDMcComas, CCReger, TS Pyrimidine PDE10 inhibitors US Patent  US9663513 Publication Date 5/30/2017 
Target
Name:
cAMP and cAMP-inhibited cGMP 3',5'-cyclic phosphodiesterase 10A
Synonyms:
3',5'-cyclic phosphodiesterase PDE10_HUMAN Phosphodiesterase 10A
Type:
Protein
Mol. Mass.:
88412.52
Organism:
Homo sapiens (Human)
Description:
Q9Y233
Residue:
779
  
Inhibitor
Name:
BDBM329474
Synonyms:
5-(2-chloro-5- (trifluoromethyl)pyridin-3- yl)-4-(((1S,2S)-2-(5- methoxypyridin-2- yl)cyclopropyl)methoxy)- 2-methylpyrimidine | US9663513, 87
Type:
Small organic molecule
Emp. Form.:
C21H18ClF3N4O2
Mol. Mass.:
450.841
SMILES:
COc1ccc(nc1)[C@H]1C[C@@H]1COc1nc(C)ncc1-c1cc(cnc1Cl)C(F)(F)F
: