Target
cAMP and cAMP-inhibited cGMP 3',5'-cyclic phosphodiesterase 10A
Ligand
BDBM329505
Substrate
Meas. Tech.
Fluorescence Polarization Assay
Ki
0.100±n/a nM
Citation
 Kuduk, SDMcComas, CCReger, TS Pyrimidine PDE10 inhibitors US Patent  US9663513 Publication Date 5/30/2017 
Target
Name:
cAMP and cAMP-inhibited cGMP 3',5'-cyclic phosphodiesterase 10A
Synonyms:
3',5'-cyclic phosphodiesterase PDE10A Phosphodiesterase 10 (PDE10) | Phosphodiesterase 10A
Type:
Protein
Mol. Mass.:
88412.52
Organism:
Homo sapiens (Human)
Description:
Q9Y233
Residue:
1055
  
Inhibitor
Name:
BDBM329505
Synonyms:
2-(4-methyl-5-(2-methyl-4- (((1S,2S)-2-(pyridin-2- yl)cyclopropyl)methoxy) pyrimidin-5-yl)pyridin-2- yl)propan-2-ol | US9663513, 118
Type:
Small organic molecule
Emp. Form.:
C23H26N4O2
Mol. Mass.:
390.4781
SMILES:
Cc1ncc(c(OC[C@H]2C[C@@H]2c2ccccn2)n1)-c1cnc(cc1C)C(C)(C)O
: