Target
cAMP and cAMP-inhibited cGMP 3',5'-cyclic phosphodiesterase 10A
Ligand
BDBM329559
Substrate
Meas. Tech.
Fluorescence Polarization Assay
Ki
0.290±n/a nM
Citation
 Kuduk, SDMcComas, CCReger, TS Pyrimidine PDE10 inhibitors US Patent  US9663513 Publication Date 5/30/2017 
Target
Name:
cAMP and cAMP-inhibited cGMP 3',5'-cyclic phosphodiesterase 10A
Synonyms:
3',5'-cyclic phosphodiesterase PDE10_HUMAN Phosphodiesterase 10A
Type:
Protein
Mol. Mass.:
88412.52
Organism:
Homo sapiens (Human)
Description:
Q9Y233
Residue:
779
  
Inhibitor
Name:
BDBM329559
Synonyms:
4-(4-(((1S,2S)-2-(5- methoxypyridin-2- yl)cyclopropyl)methoxy)- 2-methylpyrimidin-5- yl)benzoic acid | US9663513, 172
Type:
Small organic molecule
Emp. Form.:
C22H21N3O4
Mol. Mass.:
391.4198
SMILES:
COc1ccc(nc1)[C@H]1C[C@@H]1COc1nc(C)ncc1-c1ccc(cc1)C(O)=O
: