Target
Serine/threonine-protein kinase ATR
Ligand
BDBM329663
Substrate
Meas. Tech.
Inhibition Assay
Ki
505±n/a nM
Citation
 Charrier, JDavis, CDurrant, SEtxebarria I Jardi, GFraysse, DKay, DKnegtel, RPierard, FPinder, JStorck, P Compounds useful as inhibitors of ATR kinase US Patent  US9663519 Publication Date 5/30/2017 
Target
Name:
Serine/threonine-protein kinase ATR
Synonyms:
ATR Ataxia telangiectasia and Rad3-related protein (ATR) FRP1 | Serine-protein kinase ATR
Type:
Protein
Mol. Mass.:
301404.58
Organism:
Homo sapiens (Human)
Description:
Q13535
Residue:
2644
  
Inhibitor
Name:
BDBM329663
Synonyms:
US9663519, Compound I-3
Type:
Small organic molecule
Emp. Form.:
C18H21N7O2
Mol. Mass.:
367.405
SMILES:
CC(C)Oc1ccncc1NC(=O)c1c(N)nn2cc3CNCCc3nc12
: