Target
Bromodomain-containing protein 4
Ligand
BDBM329750
Substrate
Meas. Tech.
Time-Resolved Fluorescence Resonance energy Transfer (TR-FRET) Assay
IC50
310±n/a nM
Citation
 Schmees, NKuhnke, JHaendler, BNeuhaus, RLejeune, PSiegel, SKrüger, MFernandez-Montalvan, AEKünzer, HGallenkamp, D BET protein-inhibiting 5-aryltriazoleazepines US Patent  US9663523 Publication Date 5/30/2017 
Target
Name:
Bromodomain-containing protein 4
Synonyms:
BRD4 Bromodomain-containing protein 4 (BRD4) Protein HUNK1
Type:
Protein
Mol. Mass.:
152264.84
Organism:
Homo sapiens (Human)
Description:
O60885
Residue:
1362
  
Inhibitor
Name:
BDBM329750
Synonyms:
Preparation of 2-[6-(4-chlorophenyl)-1-methyl-4H-[1,2,4]triazolo[4,3-a][1]-benzazepin-4-yl]-1-(morpholin-4-yl)ethanone | US9663523, Example 14
Type:
Small organic molecule
Emp. Form.:
C24H23ClN4O2
Mol. Mass.:
434.918
SMILES:
Cc1nnc2C(CC(=O)N3CCOCC3)C=C(c3ccc(Cl)cc3)c3ccccc3-n12
: