Target
Bromodomain-containing protein 4
Ligand
BDBM329776
Substrate
Meas. Tech.
Time-Resolved Fluorescence Resonance energy Transfer (TR-FRET) Assay
IC50
40.0±n/a nM
Citation
 Schmees, NKuhnke, JHaendler, BNeuhaus, RLejeune, PSiegel, SKrüger, MFernandez-Montalvan, AEKünzer, HGallenkamp, D BET protein-inhibiting 5-aryltriazoleazepines US Patent  US9663523 Publication Date 5/30/2017 
Target
Name:
Bromodomain-containing protein 4
Synonyms:
BRD4 Bromodomain-containing protein 4 (BRD4) Protein HUNK1
Type:
Protein
Mol. Mass.:
152264.84
Organism:
Homo sapiens (Human)
Description:
O60885
Residue:
1362
  
Inhibitor
Name:
BDBM329776
Synonyms:
Preparation of N′-acetyl-2-[(4R)-6-(4-chlorophenyl)-1-methyl-4H-[1,2,4]triazolo[4,3-a][1]benzazepin-4-yl]acetohydrazide | US9663523, Example 40
Type:
Small organic molecule
Emp. Form.:
C22H20ClN5O2
Mol. Mass.:
421.88
SMILES:
CC(=O)NNC(=O)C[C@H]1C=C(c2ccc(Cl)cc2)c2ccccc2-n2c(C)nnc12
: