Target
Ubiquitin-conjugating enzyme E2 E1
Ligand
BDBM329843
Substrate
Meas. Tech.
HTRF Assay
IC50
55±n/a nM
Citation
 Afroze, RBharathan, ITCiavarri, JPFleming, PEGaulin, JLGirard, MLangston, SPSoucy, FWong, TYe, Y Pyrazolopyrimidinyl inhibitors of ubiquitin-activating enzyme US Patent  US9663525 Publication Date 5/30/2017 
Target
Name:
Ubiquitin-conjugating enzyme E2 E1
Synonyms:
E2 ubiquitin-conjugating enzyme E1 UBCH6 | UBE2E1
Type:
Mol. Mass.:
21408.98
Organism:
Homo sapiens (Human)
Description:
P51965
Residue:
193
  
Inhibitor
Name:
BDBM329843
Synonyms:
(rac)-((1R,2R,3S,4R)-2,3-Dihydroxy-4-((2-(3-phenoxyphenyl)pyrazolo[1,5- US9663525, Compound I-051 | US9796725, Compound I-051
Type:
Small organic molecule
Emp. Form.:
C24H25N5O6S
Mol. Mass.:
511.55
SMILES:
NS(=O)(=O)OC[C@H]1C[C@@H](Nc2ccnc3cc(nn23)-c2cccc(Oc3ccccc3)c2)[C@H](O)[C@@H]1O
: