Target
Ubiquitin-conjugating enzyme E2 E1
Ligand
BDBM329875
Substrate
Meas. Tech.
HTRF Assay
IC50
<10±n/a nM
Citation
 Afroze, RBharathan, ITCiavarri, JPFleming, PEGaulin, JLGirard, MLangston, SPSoucy, FWong, TYe, Y Pyrazolopyrimidinyl inhibitors of ubiquitin-activating enzyme US Patent  US9663525 Publication Date 5/30/2017 
Target
Name:
Ubiquitin-conjugating enzyme E2 E1
Synonyms:
E2 ubiquitin-conjugating enzyme E1 UBCH6 | UBE2E1
Type:
Mol. Mass.:
21408.98
Organism:
Homo sapiens (Human)
Description:
P51965
Residue:
193
  
Inhibitor
Name:
BDBM329875
Synonyms:
(rac)-[(1R,2R,3S,4R)-4-{[2-(3-ethynylphenyl)pyrazolo[1,5-a]pyrimidin-7-yl]amino}- US9663525, Compound I-083 | US9796725, Compound I-083
Type:
Small organic molecule
Emp. Form.:
C20H21N5O5S
Mol. Mass.:
443.476
SMILES:
NS(=O)(=O)OC[C@H]1C[C@@H](Nc2ccnc3cc(nn23)-c2cccc(c2)C#C)[C@H](O)[C@@H]1O
: