Target
Ubiquitin-conjugating enzyme E2 E1
Ligand
BDBM329889
Substrate
Meas. Tech.
HTRF Assay
IC50
<10±n/a nM
Citation
 Afroze, RBharathan, ITCiavarri, JPFleming, PEGaulin, JLGirard, MLangston, SPSoucy, FWong, TYe, Y Pyrazolopyrimidinyl inhibitors of ubiquitin-activating enzyme US Patent  US9663525 Publication Date 5/30/2017 
Target
Name:
Ubiquitin-conjugating enzyme E2 E1
Synonyms:
E2 ubiquitin-conjugating enzyme E1 UBCH6 | UBE2E1
Type:
Mol. Mass.:
21408.98
Organism:
Homo sapiens (Human)
Description:
P51965
Residue:
193
  
Inhibitor
Name:
BDBM329889
Synonyms:
(rac)-((1R,2R,3S,4R)-4-(2-(5-fluoronaphthalen-1-yl)pyrazolo[1,5-a]pyrimidin-7- US9663525, Compound I-097 US9796725, Compound I-097
Type:
Small organic molecule
Emp. Form.:
C22H22FN5O5S
Mol. Mass.:
487.504
SMILES:
NS(=O)(=O)OC[C@H]1C[C@@H](Nc2ccnc3cc(nn23)-c2cccc3c(F)cccc23)[C@H](O)[C@@H]1O
: