Target
Ubiquitin-conjugating enzyme E2 E1
Ligand
BDBM329896
Substrate
Meas. Tech.
HTRF Assay
IC50
<10±n/a nM
Citation
 Afroze, RBharathan, ITCiavarri, JPFleming, PEGaulin, JLGirard, MLangston, SPSoucy, FWong, TYe, Y Pyrazolopyrimidinyl inhibitors of ubiquitin-activating enzyme US Patent  US9663525 Publication Date 5/30/2017 
Target
Name:
Ubiquitin-conjugating enzyme E2 E1
Synonyms:
E2 ubiquitin-conjugating enzyme E1 UBCH6 | UBE2E1
Type:
Mol. Mass.:
21408.98
Organism:
Homo sapiens (Human)
Description:
P51965
Residue:
193
  
Inhibitor
Name:
BDBM329896
Synonyms:
(s.e.)-((1R,2R,3S,4R)-2,3-dihydroxy-4-(2-(2-methoxynaphthalen-1-yl)pyrazolo[1,5- US9663525, Compound I-104 | US9796725, Compound I-104
Type:
Small organic molecule
Emp. Form.:
C23H25N5O6S
Mol. Mass.:
499.54
SMILES:
COc1ccc2ccccc2c1-c1cc2nccc(N[C@@H]3C[C@H](COS(N)(=O)=O)[C@@H](O)[C@H]3O)n2n1
: