Target
Ubiquitin-conjugating enzyme E2 E1
Ligand
BDBM329916
Substrate
Meas. Tech.
HTRF Assay
IC50
550±n/a nM
Citation
 Afroze, RBharathan, ITCiavarri, JPFleming, PEGaulin, JLGirard, MLangston, SPSoucy, FWong, TYe, Y Pyrazolopyrimidinyl inhibitors of ubiquitin-activating enzyme US Patent  US9663525 Publication Date 5/30/2017 
Target
Name:
Ubiquitin-conjugating enzyme E2 E1
Synonyms:
E2 ubiquitin-conjugating enzyme E1 UBCH6 | UBE2E1
Type:
Mol. Mass.:
21408.98
Organism:
Homo sapiens (Human)
Description:
P51965
Residue:
193
  
Inhibitor
Name:
BDBM329916
Synonyms:
(s.e.)-{(1R,2R,3S,4R)-4-[(3,6-dichloro-2-{3- US9663525, Compound I-124 | US9796725, Compound I-124
Type:
Small organic molecule
Emp. Form.:
C19H18Cl2F3N5O5S2
Mol. Mass.:
588.408
SMILES:
NS(=O)(=O)OC[C@H]1C[C@@H](Nc2c(Cl)cnc3c(Cl)c(nn23)-c2cccc(SC(F)(F)F)c2)[C@H](O)[C@@H]1O
: