Target
Non-receptor tyrosine-protein kinase TYK2
Ligand
BDBM329972
Substrate
Meas. Tech.
Caliper Enzyme Assay
IC50
23.0±n/a nM
Citation
 Fensome, AGopalsamy, AGerstenberger, BSEfremov, IVWan, ZPierce, BTelliez, JTrujillo, JIZhang, LXing, LSaiah, E Aminopyrimidinyl compounds US Patent  US9663526 Publication Date 5/30/2017 
Target
Name:
Non-receptor tyrosine-protein kinase TYK2
Synonyms:
Non-receptor tyrosine-protein kinase TYK2 (TYK2) TYK2_HUMAN | Tyrosine-protein kinase TYK2
Type:
Protein
Mol. Mass.:
133666.03
Organism:
Homo sapiens (Human)
Description:
P29597
Residue:
1187
  
Inhibitor
Name:
BDBM329972
Synonyms:
US10463675, Example 55 US11197867, Example 55 | US9663526, Example 55
Type:
Small organic molecule
Emp. Form.:
C18H22N8S
Mol. Mass.:
382.486
SMILES:
Cn1cc(Nc2nccc(n2)N2C[C@@H]3CC[C@H](C2)N3Cc2ccns2)cn1
: