Target
Tyrosine-protein kinase JAK1
Ligand
BDBM330000
Substrate
IC50
7.00±n/a nM
Citation
 Fensome, AGopalsamy, AGerstenberger, BSEfremov, IVWan, ZPierce, BTelliez, JTrujillo, JIZhang, LXing, LSaiah, E Aminopyrimidinyl compounds US Patent  US9663526 Publication Date 5/30/2017 
Target
Name:
Tyrosine-protein kinase JAK1
Synonyms:
JAK-1 JAK1A JAK1_HUMAN Janus kinase 1 (JAK1) | Janus kinase 1 JAK1
Type:
Protein
Mol. Mass.:
133293.73
Organism:
Homo sapiens (Human)
Description:
P23458
Residue:
1154
  
Inhibitor
Name:
BDBM330000
Synonyms:
US9663526, Example 83
Type:
Small organic molecule
Emp. Form.:
C20H27N9O2S
Mol. Mass.:
457.552
SMILES:
Cn1cc(Nc2nccc(n2)N2C[C@@H]3CC[C@H](C2)N3C2(C[N+]#[C-])CN(C2)S(C)(=O)=O)cn1
: