Target
Carbonic anhydrase 2
Ligand
BDBM11932
Substrate
BDBM11402
Meas. Tech.
In Vitro Binding for Human Carbonic Anhydrase II
pH
7.4±n/a
Temperature
310.15±n/a K
Kd
0.2±.02 nM
Citation
 Boriack-Sjodin, PAZeitlin, SChen, HHCrenshaw, LGross, SDantanarayana, ADelgado, PMay, JADean, TChristianson, DW Structural analysis of inhibitor binding to human carbonic anhydrase II. Protein Sci 7:2483-9 (1998)  
Target
Name:
Carbonic anhydrase 2
Synonyms:
CA-II CAC Carbonate dehydratase II Carbonic anhydrase 2 (CA-II) Carbonic anhydrase C Carbonic anhydrase II (CA-II) Carbonic anhydrase II (hCA II) | Carbonic anhydrase isoenzyme II (hCA II)
Type:
Enzyme
Mol. Mass.:
29250.71
Organism:
Homo sapiens (Human)
Description:
P00918
Residue:
260
  
Inhibitor
Name:
BDBM11932
Synonyms:
3,4-DIHYDRO-4-HYDROXY-2-(2-THIENYMETHYL)-2H-THIENO[3,2-E]-1,2-THIAZINE-6-SULFONAMIDE-1,1-DIOXIDE AL5300
Type:
Small organic molecule
Emp. Form.:
C11H12N2O5S4
Mol. Mass.:
380.483
SMILES:
NS(=O)(=O)c1cc2C(O)CN(Cc3cccs3)S(=O)(=O)c2s1
:
Substrate
Name:
BDBM11402
Synonyms:
5-(dimethylamino)naphthalene-1-sulfonamide | dansylamide
Type:
Small organic molecule
Emp. Form.:
C12H14N2O2S
Mol. Mass.:
250.317
SMILES:
CN(C)c1cccc2c(cccc12)S(N)(=O)=O
: