Target
Tyrosine-protein kinase Blk
Ligand
BDBM195862
Substrate
Meas. Tech.
EGFR kinase assay
Temperature
298.15±n/a K
IC50
>10000±n/a nM
Comments
extracted
Citation
 Li, HXu, YZhao, ZLiu, XZhou, WBai, FXue, MZhang, LZhang, Y Pteridine ketone derivative and applications thereof as EGFR, BLK, and FLT3 inhibitor US Patent  US9670213 Publication Date 6/6/2017 
Target
Name:
Tyrosine-protein kinase Blk
Synonyms:
B lymphoid tyrosine kinase BLK_HUMAN Tyrosine-protein kinase BLK (BLK) | p55-Blk
Type:
Protein
Mol. Mass.:
57711.88
Organism:
Homo sapiens (Human)
Description:
P51451
Residue:
505
  
Inhibitor
Name:
BDBM195862
Synonyms:
US9670213, Compound 007 N-(3-(2-(4-methoxyphenylamino)-7-oxo-8(7H)-pteridin-yl)phenyl) propionamide
Type:
Small organic molecule
Emp. Form.:
C22H20N6O3
Mol. Mass.:
416.4326
SMILES:
CCC(=O)Nc1cccc(c1)-n1c2nc(Nc3ccc(OC)cc3)ncc2ncc1=O
: