Target
Tyrosine-protein kinase Blk
Ligand
BDBM195864
Substrate
Meas. Tech.
EGFR kinase assay
Temperature
298.15±n/a K
IC50
5312±n/a nM
Comments
extracted
Citation
 Li, HXu, YZhao, ZLiu, XZhou, WBai, FXue, MZhang, LZhang, Y Pteridine ketone derivative and applications thereof as EGFR, BLK, and FLT3 inhibitor US Patent  US9670213 Publication Date 6/6/2017 
Target
Name:
Tyrosine-protein kinase Blk
Synonyms:
B lymphoid tyrosine kinase BLK_HUMAN Tyrosine-protein kinase BLK (BLK) | p55-Blk
Type:
Protein
Mol. Mass.:
57711.88
Organism:
Homo sapiens (Human)
Description:
P51451
Residue:
505
  
Inhibitor
Name:
BDBM195864
Synonyms:
US9670213, Compound 009 4-(dimethylamino)-N-(4-(2-(4-methoxyphenylamino)-7-oxo-8(7H)-pteridin-yl)phenyl)-2-buteneamide
Type:
Small organic molecule
Emp. Form.:
C25H25N7O3
Mol. Mass.:
471.5111
SMILES:
COc1ccc(Nc2ncc3ncc(=O)n(-c4ccc(NC(=O)\C=C\CN(C)C)cc4)c3n2)cc1
: