Target
Tyrosine-protein kinase Blk
Ligand
BDBM195875
Substrate
Meas. Tech.
EGFR kinase assay
Temperature
298.15±n/a K
IC50
<14±n/a nM
Comments
extracted
Citation
 Li, HXu, YZhao, ZLiu, XZhou, WBai, FXue, MZhang, LZhang, Y Pteridine ketone derivative and applications thereof as EGFR, BLK, and FLT3 inhibitor US Patent  US9670213 Publication Date 6/6/2017 
Target
Name:
Tyrosine-protein kinase Blk
Synonyms:
B lymphoid tyrosine kinase BLK_HUMAN Tyrosine-protein kinase BLK (BLK) | p55-Blk
Type:
Protein
Mol. Mass.:
57711.88
Organism:
Homo sapiens (Human)
Description:
P51451
Residue:
505
  
Inhibitor
Name:
BDBM195875
Synonyms:
US9670213, Compound 020 N-(3-(2-(4-(4-methyl-1-piperazinyl)-phenylamino)-7-oxo-8(7H)-pteridin-yl)phenyl) acrylamide
Type:
Small organic molecule
Emp. Form.:
C26H26N8O2
Mol. Mass.:
482.537
SMILES:
CN1CCN(CC1)c1ccc(Nc2ncc3ncc(=O)n(-c4cccc(NC(=O)C=C)c4)c3n2)cc1
: