Target
Tyrosine-protein kinase Blk
Ligand
BDBM195882
Substrate
Meas. Tech.
EGFR kinase assay
Temperature
298.15±n/a K
IC50
5656±n/a nM
Comments
extracted
Citation
 Li, HXu, YZhao, ZLiu, XZhou, WBai, FXue, MZhang, LZhang, Y Pteridine ketone derivative and applications thereof as EGFR, BLK, and FLT3 inhibitor US Patent  US9670213 Publication Date 6/6/2017 
Target
Name:
Tyrosine-protein kinase Blk
Synonyms:
B lymphoid tyrosine kinase BLK_HUMAN Tyrosine-protein kinase BLK (BLK) | p55-Blk
Type:
Protein
Mol. Mass.:
57711.88
Organism:
Homo sapiens (Human)
Description:
P51451
Residue:
505
  
Inhibitor
Name:
BDBM195882
Synonyms:
US9670213, Compound 027 N-(3-(8-(4-methoxyphenyl)-7-oxo-7,8-dihydro-pteridin-2-amino)phenyl) acrylamide
Type:
Small organic molecule
Emp. Form.:
C22H18N6O3
Mol. Mass.:
414.4167
SMILES:
COc1ccc(cc1)-n1c2nc(Nc3cccc(NC(=O)C=C)c3)ncc2ncc1=O
: