Target
Epidermal growth factor receptor [L858R]
Ligand
BDBM195081
Substrate
Meas. Tech.
EGFR kinase assay
Temperature
298.15±n/a K
IC50
>10000±n/a nM
Comments
extracted
Citation
 Li, HXu, YZhao, ZLiu, XZhou, WBai, FXue, MZhang, LZhang, Y Pteridine ketone derivative and applications thereof as EGFR, BLK, and FLT3 inhibitor US Patent  US9670213 Publication Date 6/6/2017 
Target
Name:
Epidermal growth factor receptor [L858R]
Synonyms:
EGFR EGFR_HUMAN ERBB1 Epidermal growth factor receptor (L858R) HER1
Type:
Mol. Mass.:
134323.62
Organism:
Homo sapiens (Human)
Description:
P00533[L858R]
Residue:
1210
  
Inhibitor
Name:
BDBM195081
Synonyms:
US9670213, Compound 001 8-(4-aminophenyl)-2-(4-methoxyphenyl)-7(8H)-pteridin-one
Type:
Small organic molecule
Emp. Form.:
C19H16N6O2
Mol. Mass.:
360.3693
SMILES:
COc1ccc(Nc2ncc3ncc(=O)n(-c4ccc(N)cc4)c3n2)cc1
: