Target
Epidermal growth factor receptor [L858R]
Ligand
BDBM195865
Substrate
Meas. Tech.
EGFR kinase assay
Temperature
298.15±n/a K
IC50
6084±n/a nM
Comments
extracted
Citation
 Li, HXu, YZhao, ZLiu, XZhou, WBai, FXue, MZhang, LZhang, Y Pteridine ketone derivative and applications thereof as EGFR, BLK, and FLT3 inhibitor US Patent  US9670213 Publication Date 6/6/2017 
Target
Name:
Epidermal growth factor receptor [L858R]
Synonyms:
EGFR EGFR_HUMAN ERBB1 Epidermal growth factor receptor (L858R) HER1
Type:
Mol. Mass.:
134323.62
Organism:
Homo sapiens (Human)
Description:
P00533[L858R]
Residue:
1210
  
Inhibitor
Name:
BDBM195865
Synonyms:
US9670213, Compound 010 4-(dimethylamino)-N-(3-(2-(4-methoxyphenylamino)-7-oxo-8(7H)-pteridin-yl)phenyl)-2-buteneamide
Type:
Small organic molecule
Emp. Form.:
C25H25N7O3
Mol. Mass.:
471.5111
SMILES:
COc1ccc(Nc2ncc3ncc(=O)n(-c4cccc(NC(=O)\C=C\CN(C)C)c4)c3n2)cc1
: