Target
Epidermal growth factor receptor
Ligand
BDBM195874
Substrate
Meas. Tech.
EGFR kinase assay
Temperature
298.15±n/a K
IC50
1260±n/a nM
Comments
extracted
Citation
 Li, HXu, YZhao, ZLiu, XZhou, WBai, FXue, MZhang, LZhang, Y Pteridine ketone derivative and applications thereof as EGFR, BLK, and FLT3 inhibitor US Patent  US9670213 Publication Date 6/6/2017 
Target
Name:
Epidermal growth factor receptor
Synonyms:
EGF Receptor Substrate EGFR_HUMAN ERBB1 Epidermal Growth Factor Receptor erbB-1 Epidermal growth factor receptor (EGFR) HER1 Proto-oncogene c-ErbB-1 Tyrosine-Protein Kinase ErbB-1
Type:
Receptor Kinase Domain
Mol. Mass.:
134279.59
Organism:
Homo sapiens (Human)
Description:
P00533
Residue:
1210
  
Inhibitor
Name:
BDBM195874
Synonyms:
US9670213, Compound 019 N-(4-(2-(4-(4-methyl-1-piperazinyl)-phenylamino)-7-oxo-8(7H)-pteridin-yl)phenyl) acrylamide
Type:
Small organic molecule
Emp. Form.:
C26H26N8O2
Mol. Mass.:
482.537
SMILES:
CN1CCN(CC1)c1ccc(Nc2ncc3ncc(=O)n(-c4ccc(NC(=O)C=C)cc4)c3n2)cc1
: