Target
Epidermal growth factor receptor [T790M,L858R]
Ligand
BDBM195876
Substrate
Meas. Tech.
EGFR kinase assay
Temperature
298.15±n/a K
IC50
5.49±n/a nM
Comments
extracted
Citation
 Li, HXu, YZhao, ZLiu, XZhou, WBai, FXue, MZhang, LZhang, Y Pteridine ketone derivative and applications thereof as EGFR, BLK, and FLT3 inhibitor US Patent  US9670213 Publication Date 6/6/2017 
Target
Name:
Epidermal growth factor receptor [T790M,L858R]
Synonyms:
EGFR EGFR_HUMAN ERBB1 Epidermal growth factor receptor (EGFR)(T790M/L858R) Epidermal growth factor receptor (T790M, L858R) Epidermal growth factor receptor(L858R, T790M) | HER1
Type:
Mol. Mass.:
134353.72
Organism:
Homo sapiens (Human)
Description:
P00533[T790M,L858R]
Residue:
1210
  
Inhibitor
Name:
BDBM195876
Synonyms:
US9670213, Compound 021 N-(3-(7-oxo-2-(4-(1-piperidinyl)phenylamino)-8(7H)-pteridinyl)phenyl) acrylamide
Type:
Small organic molecule
Emp. Form.:
C26H25N7O2
Mol. Mass.:
467.5224
SMILES:
C=CC(=O)Nc1cccc(c1)-n1c2nc(Nc3ccc(cc3)N3CCCCC3)ncc2ncc1=O
: